Reaction Details
TargetTyrosine-protein kinase Lck
LigandBDBM50060735
Substrate/Competitorn/a
Meas. Tech.ChEBML_70495
IC50 1300±n/a nM
Citation Park, SHWon, JLee, KH Design and characterization of non-phosphopeptide inhibitors for Src family SH2 domains. Bioorg Med Chem Lett12:2711-4 (2002) Tyrosine-protein kinase Lck
Name:Tyrosine-protein kinase Lck
Type:n/a
Mol. Mass.:57987.83
Organism:Homo sapiens (Human)
Description:P06239
Residue:509
BDBM50060735
NameBDBM50060735
Synonyms:2-[2-(2-{2-[(S)-2-Acetylamino-3-(4-phosphonooxy-phenyl)-propionylamino]-4-carboxy-butyrylamino}-4-carboxy-butyrylamino)-3-methyl-pentanoylamino]-pentanedioic acid | CHEMBL299477
TypeSmall organic molecule
Emp. Form.C32H46N5O17P
Mol. Mass.803.7047
SMILESCC[C@H](C)[C@H](NC(=O)[C@H](CCC(O)=O)NC(=O)[C@H](CCC(O)=O)NC(=O)[C@H](Cc1ccc(OP(O)(O)=O)cc1)NC(C)=O)C(=O)N[C@@H](CCC(O)=O)C(O)=O