Reaction Details
TargetTyrosine-protein kinase Fyn
LigandBDBM50118655
Substrate/Competitorn/a
Meas. Tech.ChEBML_70388
IC50 84.0±n/a nM
Citation Park, SHWon, JLee, KH Design and characterization of non-phosphopeptide inhibitors for Src family SH2 domains. Bioorg Med Chem Lett12:2711-4 (2002) Tyrosine-protein kinase Fyn
Name:Tyrosine-protein kinase Fyn
Type:Enzyme
Mol. Mass.:60762.21
Organism:Homo sapiens (Human)
Description:P06241
Residue:537
BDBM50118655
NameBDBM50118655
Synonyms:CHEMBL432649 | Ca-pYEEIE
TypeSmall organic molecule
Emp. Form.C38H50N5O18P
Mol. Mass.895.8001
SMILESCC[C@H](C)[C@H](NC(=O)[C@H](CCC(O)=O)NC(=O)[C@H](CCC(O)=O)NC(=O)[C@H](Cc1ccc(OP(O)(O)=O)cc1)N=CCc1ccc(O)c(O)c1)C(=O)N[C@@H](CCC(O)=O)C(O)=O