Reaction Details
TargetTyrosine-protein kinase Fyn
LigandBDBM50118659
Substrate/Competitorn/a
Meas. Tech.ChEBML_70388
IC50 45000±n/a nM
Citation Park, SHWon, JLee, KH Design and characterization of non-phosphopeptide inhibitors for Src family SH2 domains. Bioorg Med Chem Lett12:2711-4 (2002) Tyrosine-protein kinase Fyn
Name:Tyrosine-protein kinase Fyn
Type:Enzyme
Mol. Mass.:60762.21
Organism:Homo sapiens (Human)
Description:P06241
Residue:537
BDBM50118659
NameBDBM50118659
Synonyms:CHEMBL327820 | Ca-YEEIE
TypeSmall organic molecule
Emp. Form.C39H49N5O16
Mol. Mass.843.8303
SMILESCC[C@H](C)[C@H](NC(=O)[C@H](CCC(O)=O)NC(=O)[C@H](CCC(O)=O)NC(=O)[C@H](Cc1ccc(O)cc1)NC(=O)\C=C\c1ccc(O)c(O)c1)C(=O)N[C@@H](CCC(O)=O)C(O)=O