Reaction Details
TargetTyrosine-protein kinase Lck
LigandBDBM50118658
Substrate/Competitorn/a
Meas. Tech.ChEBML_70495
IC50 3800±n/a nM
Citation Park, SHWon, JLee, KH Design and characterization of non-phosphopeptide inhibitors for Src family SH2 domains. Bioorg Med Chem Lett12:2711-4 (2002) Tyrosine-protein kinase Lck
Name:Tyrosine-protein kinase Lck
Type:n/a
Mol. Mass.:57987.83
Organism:Homo sapiens (Human)
Description:P06239
Residue:509
BDBM50118658
NameBDBM50118658
Synonyms:Ac-YAEIE | CHEMBL90294
TypeSmall organic molecule
Emp. Form.C30H43N5O12
Mol. Mass.665.6887
SMILESCC[C@H](C)[C@H](NC(=O)[C@H](CCC(O)=O)NC(=O)[C@H](C)NC(=O)[C@H](Cc1ccc(O)cc1)NC(C)=O)C(=O)N[C@@H](CCC(O)=O)C(O)=O