Reaction Details
TargetAlpha-1B adrenergic receptor
LigandBDBM50022722
Substrate/Competitorn/a
Meas. Tech.ChEMBL_34311 (CHEMBL648096)
Ki 9600±n/a nM
Citation Altenbach, RJKhilevich, AMeyer, MDBuckner, SAMilicic, IDaza, AVBrune, MEO'Neill, ABGauvin, DMCain, JCNakane, MHolladay, MWWilliams, MBrioni, JDSullivan, JP N-[3-(1H-imidazol-4-ylmethyl)phenyl]ethanesulfonamide (ABT-866, 1),(1) a novel alpha(1)-adrenoceptor ligand with an enhanced in vitro and in vivo profile relative to phenylpropanolamine and midodrine. J Med Chem45:4395-7 (2002) Alpha-1B adrenergic receptor
Name:Alpha-1B adrenergic receptor
Type:Enzyme
Mol. Mass.:56862.13
Organism:Homo sapiens (Human)
Description:P35368
Residue:520
BDBM50022722
NameBDBM50022722
Synonyms:(+)2-Amino-1-phenyl-propan-1-ol (1R, 2S)-2-Amino-1-phenyl-propan-1-ol (1S, 2S)-2-Amino-1-phenyl-propan-1-ol Biphetap Bromatapp Codamine Demazin Dimetapp Hycomine Norephedrine, (-) PHENYLPROPANOLAMINE Pseudonorephedrine, (-) [cathine, (-)] Triaminic-12
TypeSmall organic molecule
Emp. Form.C9H13NO
Mol. Mass.151.2056
SMILESCC(N)C(O)c1ccccc1