Reaction Details
TargetAlpha-1B adrenergic receptor
LigandBDBM50118703
Substrate/Competitorn/a
Meas. Tech.ChEMBL_34627 (CHEMBL647272)
EC50 320±n/a nM
Citation Altenbach, RJKhilevich, AMeyer, MDBuckner, SAMilicic, IDaza, AVBrune, MEO'Neill, ABGauvin, DMCain, JCNakane, MHolladay, MWWilliams, MBrioni, JDSullivan, JP N-[3-(1H-imidazol-4-ylmethyl)phenyl]ethanesulfonamide (ABT-866, 1),(1) a novel alpha(1)-adrenoceptor ligand with an enhanced in vitro and in vivo profile relative to phenylpropanolamine and midodrine. J Med Chem45:4395-7 (2002) Alpha-1B adrenergic receptor
Name:Alpha-1B adrenergic receptor
Type:G Protein-Coupled Receptor (GPCR)
Mol. Mass.:56606.71
Organism:Rattus norvegicus (rat)
Description:Receptor binding assays were performed using rat cortical membranes.
Residue:515
BDBM50118703
NameBDBM50118703
Synonyms:CHEMBL109783 | N-[5-(4,5-Dihydro-1H-imidazol-2-yl)-2-hydroxy-5,6,7,8-tetrahydro-naphthalen-1-yl]-methanesulfonamide
TypeSmall organic molecule
Emp. Form.C14H19N3O3S
Mol. Mass.309.384
SMILESCS(=O)(=O)Nc1c(O)ccc2C(CCCc12)C1=NCCN1