Reaction Details
TargetAlpha-1B adrenergic receptor
LigandBDBM50118705
Substrate/Competitorn/a
Meas. Tech.ChEMBL_34199 (CHEMBL649216)
Ki 880.0±n/a nM
Citation Altenbach, RJKhilevich, AMeyer, MDBuckner, SAMilicic, IDaza, AVBrune, MEO'Neill, ABGauvin, DMCain, JCNakane, MHolladay, MWWilliams, MBrioni, JDSullivan, JP N-[3-(1H-imidazol-4-ylmethyl)phenyl]ethanesulfonamide (ABT-866, 1),(1) a novel alpha(1)-adrenoceptor ligand with an enhanced in vitro and in vivo profile relative to phenylpropanolamine and midodrine. J Med Chem45:4395-7 (2002) Alpha-1B adrenergic receptor
Name:Alpha-1B adrenergic receptor
Type:Enzyme
Mol. Mass.:56862.13
Organism:Homo sapiens (Human)
Description:P35368
Residue:520
BDBM50118705
NameBDBM50118705
Synonyms:ABT-866 Ethanesulfonic acid [3-(1H-imidazol-4-ylmethyl)-phenyl]-amide N-[3-(1H-imidazol-4-ylmethyl)-phenyl]ethanesulfonamide
TypeSmall organic molecule
Emp. Form.C12H15N3O2S
Mol. Mass.265.331
SMILESCCS(=O)(=O)Nc1cccc(Cc2cnc[nH]2)c1