Reaction Details
TargetIntegrin alpha-4/beta-7
LigandBDBM50119090
Substrate/Competitorn/a
Meas. Tech.ChEMBL_217621 (CHEMBL820364)
IC50 48±n/a nM
Citation Castanedo, GMSailes, FCDubree, NJNicholas, JBCaris, LClark, KKeating, SMBeresini, MHChiu, HFong, SMarsters, JCJackson, DYSutherlin, DP Solid-phase synthesis of dual alpha4beta1/alpha4beta7 integrin antagonists: two scaffolds with overlapping pharmacophores. Bioorg Med Chem Lett12:2913-7 (2002) Integrin alpha-4/beta-7
Name:Integrin alpha-4/beta-7
Type:Protein Complex
Mol. Mass.:n/a
Description:The assay uses stably transfected K562 cells expressing human alpha4beta7 integrin.
Components:This complex has 2 components.
Component 1
Name:Integrin alpha-4
Synonyms:CD49 antigen-like family member D CD49d antigen ITA4_HUMAN Integrin alpha-4 Integrin alpha-IV VLA-4 integrin alpha 4 precursor | integrin alpha-4 precursor
Type:Membrane Protein
Mol. Mass.:114897.35
Organism:Homo sapiens (Human)
Description:P13612
Residue:1032
Component 2
Name:Integrin beta-7
Synonyms:ITB7_HUMAN Integrin alpha-4/beta-7 Integrin beta7
Type:Membrane Protein
Mol. Mass.:86893.88
Organism:Homo sapiens (Human)
Description:P26010
Residue:798
BDBM50119090
NameBDBM50119090
Synonyms:(S)-2-(2-Chloro-benzoylamino)-3-[2'-(phenethylamino-methyl)-biphenyl-4-yl]-propionic acid | CHEMBL318676
TypeSmall organic molecule
Emp. Form.C31H29ClN2O3
Mol. Mass.513.027
SMILESOC(=O)[C@H](Cc1ccc(cc1)-c1ccccc1CNCCc1ccccc1)NC(=O)c1ccccc1Cl