Reaction Details
TargetIntegrin alpha-4/beta-1
LigandBDBM50119087
Substrate/Competitorn/a
Meas. Tech.ChEMBL_217453 (CHEMBL823502)
IC50 25±n/a nM
Citation Castanedo, GMSailes, FCDubree, NJNicholas, JBCaris, LClark, KKeating, SMBeresini, MHChiu, HFong, SMarsters, JCJackson, DYSutherlin, DP Solid-phase synthesis of dual alpha4beta1/alpha4beta7 integrin antagonists: two scaffolds with overlapping pharmacophores. Bioorg Med Chem Lett12:2913-7 (2002) Integrin alpha-4/beta-1
Name:Integrin alpha-4/beta-1
Type:n/a
Mol. Mass.:n/a
Description:ASSAY_ID of EBI is 88912
Components:This complex has 2 components.
Component 1
Name:Integrin beta-1
Synonyms:CD_antigen=CD29 Fibronectin receptor beta GPIIA ITGB1 MDF2 | MSK12
Type:Enzyme
Mol. Mass.:88400.38
Organism:Homo sapiens (Human)
Description:P05556
Residue:798
Component 2
Name:Integrin alpha-4
Synonyms:CD49 antigen-like family member D CD49d antigen ITA4_HUMAN Integrin alpha-4 Integrin alpha-IV VLA-4 integrin alpha 4 precursor | integrin alpha-4 precursor
Type:Membrane Protein
Mol. Mass.:114897.35
Organism:Homo sapiens (Human)
Description:P13612
Residue:1032
BDBM50119087
NameBDBM50119087
Synonyms:(S)-2-(2-Chloro-benzoylamino)-3-(2'-{[2-(4-hydroxy-phenyl)-ethylamino]-methyl}-biphenyl-4-yl)-propionic acid | CHEMBL433206
TypeSmall organic molecule
Emp. Form.C31H29ClN2O4
Mol. Mass.529.026
SMILESOC(=O)[C@H](Cc1ccc(cc1)-c1ccccc1CNCCc1ccc(O)cc1)NC(=O)c1ccccc1Cl