Reaction Details
TargetAdenosine receptor A2a
LigandBDBM50119142
Substrate/Competitorn/a
Meas. Tech.ChEMBL_30140 (CHEMBL640587)
Ki 60±n/a nM
Citation Palle, VPElzein, EOGothe, SALi, ZGao, ZMeyer, SBlackburn, BZablocki, JA Structure-affinity relationships of the affinity of 2-pyrazolyl adenosine analogues for the adenosine A2A receptor. Bioorg Med Chem Lett12:2935-9 (2002) Adenosine receptor A2a
Name:Adenosine receptor A2a
Type:G Protein-Coupled Receptor (GPCR)
Mol. Mass.:45015.65
Organism:Rattus norvegicus (rat)
Description:Rat A2A receptors expressed in CHO cells.
Residue:410
BDBM50119142
NameBDBM50119142
Synonyms:1-[6-Amino-9-((2R,3R,4S,5R)-3,4-dihydroxy-5-hydroxymethyl-tetrahydro-furan-2-yl)-9H-purin-2-yl]-1H-pyrazole-4-carboxylic acid ethyl ester | CHEMBL101218
TypeSmall organic molecule
Emp. Form.C16H19N7O6
Mol. Mass.405.3654
SMILESCCOC(=O)c1cnn(c1)-c1nc(N)c2ncn([C@@H]3O[C@H](CO)[C@@H](O)[C@H]3O)c2n1