Reaction Details
TargetEndothelin-1 receptor
LigandBDBM50119671
Substrate/Competitorn/a
Meas. Tech.ChEBML_65490
IC50 0.210000±n/a nM
Citation Niiyama, KTakahashi, HNagase, TKojima, HAmano, YKatsuki, KYamakawa, TOzaki, SIhara, MYano, MFukuroda, TNishikibe, MIshikawa, K Structure-Activity relationships of 2-substituted 5,7-Diarylcyclopenteno[1,2-b]pyridine-6-carboxylic acids as a novel class of endothelin receptor antagonists. Bioorg Med Chem Lett12:3041-5 (2002) Endothelin-1 receptor
Name:Endothelin-1 receptor
Type:Enzyme Catalytic Domain
Mol. Mass.:48736.88
Organism:Homo sapiens (Human)
Description:P25101
Residue:427
BDBM50119671
NameBDBM50119671
Synonyms:5-Benzo[1,3]dioxol-5-yl-2-butyl-7-(4-methoxy-phenyl)-6,7-dihydro-5H-[1]pyrindine-6-carboxylic acid | CHEMBL102969
TypeSmall organic molecule
Emp. Form.C27H27NO5
Mol. Mass.445.507
SMILESCCCCc1ccc2[C@@H]([C@H]([C@@H](c2n1)c1ccc(OC)cc1)C(O)=O)c1ccc2OCOc2c1