Reaction Details
TargetD(4) dopamine receptor
LigandBDBM50119899
Substrate/Competitorn/a
Meas. Tech.ChEBML_62966
Ki 12±n/a nM
Citation Zhao, HThurkauf, AHe, XHodgetts, KZhang, XRachwal, SKover, RXHutchison, APeterson, JKieltyka, ABrodbeck, RPrimus, RWasley, JW Indoline and piperazine containing derivatives as a novel class of mixed D(2)/D(4) receptor antagonists. Part 1: identification and structure-activity relationships. Bioorg Med Chem Lett12:3105-9 (2002) D(4) dopamine receptor
Name:D(4) dopamine receptor
Type:Enzyme
Mol. Mass.:48373.19
Organism:Homo sapiens (Human)
Description:P21917
Residue:419
BDBM50119899
NameBDBM50119899
Synonyms:2-[4-(4-Isopropyl-benzyl)-piperazin-1-yl]-1-(2-methyl-2,3-dihydro-indol-1-yl)-ethanone | CHEMBL320440
TypeSmall organic molecule
Emp. Form.C25H33N3O
Mol. Mass.391.549
SMILESCC(C)c1ccc(CN2CCN(CC(=O)N3C(C)Cc4ccccc34)CC2)cc1