Reaction Details
TargetD(4) dopamine receptor
LigandBDBM50119883
Substrate/Competitorn/a
Meas. Tech.ChEBML_62966
Ki 7±n/a nM
Citation Zhao, HThurkauf, AHe, XHodgetts, KZhang, XRachwal, SKover, RXHutchison, APeterson, JKieltyka, ABrodbeck, RPrimus, RWasley, JW Indoline and piperazine containing derivatives as a novel class of mixed D(2)/D(4) receptor antagonists. Part 1: identification and structure-activity relationships. Bioorg Med Chem Lett12:3105-9 (2002) D(4) dopamine receptor
Name:D(4) dopamine receptor
Type:Enzyme
Mol. Mass.:48373.19
Organism:Homo sapiens (Human)
Description:P21917
Residue:419
BDBM50119883
NameBDBM50119883
Synonyms:1-{2-[4-(4-Chloro-benzyl)-piperazin-1-yl]-ethyl}-1,3-dihydro-benzo[c]isothiazole 2,2-dioxide | CHEMBL104800
TypeSmall organic molecule
Emp. Form.C20H24ClN3O2S
Mol. Mass.405.941
SMILESClc1ccc(CN2CCN(CCN3c4ccccc4CS3(=O)=O)CC2)cc1