Reaction Details
TargetD(4) dopamine receptor
LigandBDBM50119924
Substrate/Competitorn/a
Meas. Tech.ChEBML_62966
Ki 8±n/a nM
Citation Zhao, HThurkauf, AHe, XHodgetts, KZhang, XRachwal, SKover, RXHutchison, APeterson, JKieltyka, ABrodbeck, RPrimus, RWasley, JW Indoline and piperazine containing derivatives as a novel class of mixed D(2)/D(4) receptor antagonists. Part 1: identification and structure-activity relationships. Bioorg Med Chem Lett12:3105-9 (2002) D(4) dopamine receptor
Name:D(4) dopamine receptor
Type:Enzyme
Mol. Mass.:48373.19
Organism:Homo sapiens (Human)
Description:P21917
Residue:419
BDBM50119924
NameBDBM50119924
Synonyms:2-[4-(2,5-Dimethyl-benzyl)-piperazin-1-yl]-1-(2-methyl-2,3-dihydro-indol-1-yl)-ethanone | CHEMBL105304
TypeSmall organic molecule
Emp. Form.C24H31N3O
Mol. Mass.377.5224
SMILESCC1Cc2ccccc2N1C(=O)CN1CCN(Cc2cc(C)ccc2C)CC1