Reaction Details
TargetD(4) dopamine receptor
LigandBDBM50119908
Substrate/Competitorn/a
Meas. Tech.ChEBML_62966
Ki 3±n/a nM
Citation Zhao, HThurkauf, AHe, XHodgetts, KZhang, XRachwal, SKover, RXHutchison, APeterson, JKieltyka, ABrodbeck, RPrimus, RWasley, JW Indoline and piperazine containing derivatives as a novel class of mixed D(2)/D(4) receptor antagonists. Part 1: identification and structure-activity relationships. Bioorg Med Chem Lett12:3105-9 (2002) D(4) dopamine receptor
Name:D(4) dopamine receptor
Type:Enzyme
Mol. Mass.:48373.19
Organism:Homo sapiens (Human)
Description:P21917
Residue:419
BDBM50119908
NameBDBM50119908
Synonyms:2-[1-(3-Fluoro-4-methyl-benzyl)-piperidin-4-yl]-1-(2-methyl-2,3-dihydro-indol-1-yl)-ethanone | CHEMBL104273
TypeSmall organic molecule
Emp. Form.C24H29FN2O
Mol. Mass.380.4983
SMILESCC1Cc2ccccc2N1C(=O)CC1CCN(Cc2ccc(C)c(F)c2)CC1