Reaction Details
TargetD(4) dopamine receptor
LigandBDBM50119957
Substrate/Competitorn/a
Meas. Tech.ChEBML_62966
Ki 14±n/a nM
Citation Zhao, HThurkauf, AHe, XHodgetts, KZhang, XRachwal, SKover, RXHutchison, APeterson, JKieltyka, ABrodbeck, RPrimus, RWasley, JW Indoline and piperazine containing derivatives as a novel class of mixed D(2)/D(4) receptor antagonists. Part 1: identification and structure-activity relationships. Bioorg Med Chem Lett12:3105-9 (2002) D(4) dopamine receptor
Name:D(4) dopamine receptor
Type:Enzyme
Mol. Mass.:48373.19
Organism:Homo sapiens (Human)
Description:P21917
Residue:419
BDBM50119957
NameBDBM50119957
Synonyms:2-[4-(4-Chloro-benzyl)-piperazin-1-yl]-1-(2,3-dihydro-benzo[1,4]thiazin-4-yl)-ethanone | CHEMBL104238
TypeSmall organic molecule
Emp. Form.C21H24ClN3OS
Mol. Mass.401.953
SMILESClc1ccc(CN2CCN(CC(=O)N3CCSc4ccccc34)CC2)cc1