Reaction Details
TargetD(2) dopamine receptor
LigandBDBM50119911
Substrate/Competitorn/a
Meas. Tech.ChEMBL_61300 (CHEMBL673093)
Ki 9±n/a nM
Citation Zhao, HThurkauf, AHe, XHodgetts, KZhang, XRachwal, SKover, RXHutchison, APeterson, JKieltyka, ABrodbeck, RPrimus, RWasley, JW Indoline and piperazine containing derivatives as a novel class of mixed D(2)/D(4) receptor antagonists. Part 1: identification and structure-activity relationships. Bioorg Med Chem Lett12:3105-9 (2002) D(2) dopamine receptor
Name:D(2) dopamine receptor
Type:Cell-surface receptors
Mol. Mass.:50647.10
Organism:Homo sapiens (Human)
Description:P14416
Residue:443
BDBM50119911
NameBDBM50119911
Synonyms:2-[4-(4-Chloro-benzyl)-piperazin-1-yl]-1-(2-methyl-2,3-dihydro-indol-1-yl)-ethanone | CHEMBL106916
TypeSmall organic molecule
Emp. Form.C22H26ClN3O
Mol. Mass.383.914
SMILESCC1Cc2ccccc2N1C(=O)CN1CCN(Cc2ccc(Cl)cc2)CC1