Reaction Details
TargetGenome polyprotein
LigandBDBM50120296
Substrate/Competitorn/a
Meas. Tech.ChEBML_143490
Ki 8±n/a nM
Citation Priestley, ESDe Lucca, IGhavimi, BErickson-Viitanen, SDecicco, CP P1 Phenethyl peptide boronic acid inhibitors of HCV NS3 protease. Bioorg Med Chem Lett12:3199-202 (2002) Genome polyprotein
Name:Genome polyprotein
Type:Protein
Mol. Mass.:67067.41
Organism:Hepatitis C virus
Description:A3EZI9
Residue:631
BDBM50120296
NameBDBM50120296
Synonyms:CHEMBL419918 | Peptide Boronic Acid analogue
TypeSmall organic molecule
Emp. Form.C37H61BN6O11
Mol. Mass.776.725
SMILESCC[C@H](NC(=O)[C@H]1CCCN1C(=O)[C@@H](NC(=O)[C@@H](NC(=O)[C@H](CCC(O)=O)NC(=O)[C@@H](N)CC(O)=O)C(C)C)C(C)C)B1O[C@@H]2C[C@@H]3C[C@@H](C3(C)C)[C@]2(C)O1