Reaction Details
TargetGenome polyprotein
LigandBDBM50120313
Substrate/Competitorn/a
Meas. Tech.ChEBML_143490
Ki 900±n/a nM
Citation Priestley, ESDe Lucca, IGhavimi, BErickson-Viitanen, SDecicco, CP P1 Phenethyl peptide boronic acid inhibitors of HCV NS3 protease. Bioorg Med Chem Lett12:3199-202 (2002) Genome polyprotein
Name:Genome polyprotein
Type:Protein
Mol. Mass.:67067.41
Organism:Hepatitis C virus
Description:A3EZI9
Residue:631
BDBM50120313
NameBDBM50120313
Synonyms:CHEMBL320103 | Peptide Boronic Acid analogue
TypeSmall organic molecule
Emp. Form.C41H61BN6O11
Mol. Mass.824.768
SMILESCC(C)[C@H](NC(=O)[C@H](CCC(O)=O)NC(=O)[C@@H](N)CC(O)=O)C(=O)N[C@@H](C(C)C)C(=O)N1CCC[C@@H]1C(=O)N[C@H](B1O[C@@H]2C[C@@H]3C[C@@H](C3(C)C)[C@]2(C)O1)c1ccccc1