Reaction Details
TargetNeutrophil elastase
LigandBDBM50120285
Substrate/Competitorn/a
Meas. Tech.ChEBML_63797
IC50 400±n/a nM
Citation Priestley, ESDe Lucca, IGhavimi, BErickson-Viitanen, SDecicco, CP P1 Phenethyl peptide boronic acid inhibitors of HCV NS3 protease. Bioorg Med Chem Lett12:3199-202 (2002) Neutrophil elastase
Name:Neutrophil elastase
Type:Enzyme
Mol. Mass.:28532.38
Organism:Homo sapiens (Human)
Description:P08246
Residue:267
BDBM50120285
NameBDBM50120285
Synonyms:CHEMBL108657 | Peptide Boronic Acid analogue
TypeSmall organic molecule
Emp. Form.C49H75BN6O11
Mol. Mass.934.964
SMILESCC(C)[C@H](NC(=O)[C@H](CCC(O)=O)NC(=O)[C@@H](N)CC(O)=O)C(=O)N[C@@H](C(C)C)C(=O)N1CCC[C@@H]1C(=O)N[C@@H](CCc1ccc(cc1)C1CCCCC1)B1O[C@@H]2C[C@@H]3C[C@@H](C3(C)C)[C@]2(C)O1