Reaction Details
TargetNeutrophil elastase
LigandBDBM50120290
Substrate/Competitorn/a
Meas. Tech.ChEBML_63797
IC50 560.0±n/a nM
Citation Priestley, ESDe Lucca, IGhavimi, BErickson-Viitanen, SDecicco, CP P1 Phenethyl peptide boronic acid inhibitors of HCV NS3 protease. Bioorg Med Chem Lett12:3199-202 (2002) Neutrophil elastase
Name:Neutrophil elastase
Type:Enzyme
Mol. Mass.:28532.38
Organism:Homo sapiens (Human)
Description:P08246
Residue:267
BDBM50120290
NameBDBM50120290
Synonyms:CHEMBL107287 | Peptide Boronic Acid analogue
TypeSmall organic molecule
Emp. Form.C44H67BN6O12
Mol. Mass.882.847
SMILESCOc1ccc(CC[C@H](NC(=O)[C@H]2CCCN2C(=O)[C@@H](NC(=O)[C@@H](NC(=O)[C@H](CCC(O)=O)NC(=O)[C@@H](N)CC(O)=O)C(C)C)C(C)C)B2O[C@@H]3C[C@@H]4C[C@@H](C4(C)C)[C@]3(C)O2)cc1