Reaction Details
TargetNeutrophil elastase
LigandBDBM50120298
Substrate/Competitorn/a
Meas. Tech.ChEBML_63797
IC50 3500±n/a nM
Citation Priestley, ESDe Lucca, IGhavimi, BErickson-Viitanen, SDecicco, CP P1 Phenethyl peptide boronic acid inhibitors of HCV NS3 protease. Bioorg Med Chem Lett12:3199-202 (2002) Neutrophil elastase
Name:Neutrophil elastase
Type:Enzyme
Mol. Mass.:28532.38
Organism:Homo sapiens (Human)
Description:P08246
Residue:267
BDBM50120298
NameBDBM50120298
Synonyms:CHEMBL109434 | Peptide Boronic Acid analogue
TypeSmall organic molecule
Emp. Form.C43H65BN6O11
Mol. Mass.852.821
SMILESCC(C)[C@H](NC(=O)[C@H](CCC(O)=O)NC(=O)[C@@H](N)CC(O)=O)C(=O)N[C@@H](C(C)C)C(=O)N1CCC[C@@H]1C(=O)N[C@@H](CCc1ccccc1)B1O[C@@H]2C[C@@H]3C[C@@H](C3(C)C)[C@]2(C)O1