Reaction Details
TargetChymotrypsin-C
LigandBDBM50120309
Substrate/Competitorn/a
Meas. Tech.ChEMBL_197808 (CHEMBL802338)
IC50 70.0±n/a nM
Citation Priestley, ESDe Lucca, IGhavimi, BErickson-Viitanen, SDecicco, CP P1 Phenethyl peptide boronic acid inhibitors of HCV NS3 protease. Bioorg Med Chem Lett12:3199-202 (2002) Chymotrypsin-C
Name:Chymotrypsin-C
Type:Enzyme
Mol. Mass.:29487.98
Organism:Homo sapiens (Human)
Description:Q99895
Residue:268
BDBM50120309
NameBDBM50120309
Synonyms:CHEMBL108189 | Peptide Boronic Acid analogue
TypeSmall organic molecule
Emp. Form.C42H63BN6O11
Mol. Mass.838.794
SMILESCC(C)[C@H](NC(=O)[C@H](CCC(O)=O)NC(=O)[C@@H](N)CC(O)=O)C(=O)N[C@@H](C(C)C)C(=O)N1CCC[C@@H]1C(=O)N[C@@H](Cc1ccccc1)B1O[C@@H]2C[C@@H]3C[C@@H](C3(C)C)[C@]2(C)O1