Reaction Details
TargetChymotrypsin-C
LigandBDBM50120292
Substrate/Competitorn/a
Meas. Tech.ChEMBL_197808 (CHEMBL802338)
IC50 300±n/a nM
Citation Priestley, ESDe Lucca, IGhavimi, BErickson-Viitanen, SDecicco, CP P1 Phenethyl peptide boronic acid inhibitors of HCV NS3 protease. Bioorg Med Chem Lett12:3199-202 (2002) Chymotrypsin-C
Name:Chymotrypsin-C
Type:Enzyme
Mol. Mass.:29487.98
Organism:Homo sapiens (Human)
Description:Q99895
Residue:268
BDBM50120292
NameBDBM50120292
Synonyms:CHEMBL322110 | Peptide Boronic Acid analogue
TypeSmall organic molecule
Emp. Form.C40H67BN6O11
Mol. Mass.818.805
SMILESCC(C)CC[C@H](NC(=O)[C@H]1CCCN1C(=O)[C@@H](NC(=O)[C@@H](NC(=O)[C@H](CCC(O)=O)NC(=O)[C@@H](N)CC(O)=O)C(C)C)C(C)C)B1O[C@@H]2C[C@@H]3C[C@@H](C3(C)C)[C@]2(C)O1