Reaction Details
TargetIntegrin alpha-IIb/beta-3
LigandBDBM50120520
Substrate/Competitorn/a
Meas. Tech.ChEMBL_218208 (CHEMBL824556)
IC50 110±n/a nM
Citation Perron-Sierra, FSaint Dizier, DBertrand, MGenton, ATucker, GCCasara, P Substituted benzocyloheptenes as potent and selective alpha(v) integrin antagonists. Bioorg Med Chem Lett12:3291-6 (2002) Integrin alpha-IIb/beta-3
Name:Integrin alpha-IIb/beta-3
Synonyms:Glycoprotein IIb/IIIa
Type:n/a
Mol. Mass.:n/a
Description:ASSAY_ID of EBI is 30109
Components:This complex has 2 components.
Component 1
Name:Integrin beta-3
Type:Protein
Mol. Mass.:87038.91
Organism:Homo sapiens (Human)
Description:P05106
Residue:788
Component 2
Name:Integrin alpha-IIb
Synonyms:CD_antigen=CD41 GPIIb Glycoprotein IIb ITGA2B Integrin alpha-IIb heavy chain Integrin alpha-IIb light chain, form 2 Integrin alpha-V/beta-3 and alpha-IIb/beta 3 | Platelet membrane glycoprotein IIb
Type:Protein
Mol. Mass.:113354.85
Organism:Homo sapiens (Human)
Description:P08514
Residue:1039
BDBM50120520
NameBDBM50120520
Synonyms:(7-{[4-(4,5-Dihydro-1H-imidazol-2-ylamino)-butyrylamino]-methyl}-6,9-dihydro-5H-benzocyclohepten-5-yl)-acetic acid | CHEMBL327102
TypeSmall organic molecule
Emp. Form.C21H28N4O3
Mol. Mass.384.472
SMILESOC(=O)CC1CC(CNC(=O)CCCNC2=NCCN2)=CCc2ccccc12