Reaction Details
TargetIntegrin alpha-V/beta-5
LigandBDBM50120519
Substrate/Competitorn/a
Meas. Tech.ChEMBL_214771 (CHEMBL816229)
IC50 0.100000±n/a nM
Citation Perron-Sierra, FSaint Dizier, DBertrand, MGenton, ATucker, GCCasara, P Substituted benzocyloheptenes as potent and selective alpha(v) integrin antagonists. Bioorg Med Chem Lett12:3291-6 (2002) Integrin alpha-V/beta-5
Name:Integrin alpha-V/beta-5
Type:Enzyme
Mol. Mass.:n/a
Description:n/a
Components:This complex has 2 components.
Component 1
Name:Integrin alpha-V
Synonyms:ITAV_HUMAN Integrin alpha-V/alpha-5 VNRA Vitronectin receptor | Vitronectin receptor subunit alpha
Type:PROTEIN
Mol. Mass.:116024.92
Organism:Homo sapiens (Human)
Description:ChEMBL_582336
Residue:1048
Component 2
Name:Integrin beta-5
Synonyms:ITB5_HUMAN | ITGB5
Type:PROTEIN
Mol. Mass.:88047.37
Organism:Homo sapiens (Human)
Description:EBI_10915
Residue:799
BDBM50120519
NameBDBM50120519
Synonyms:(7-{[4-(1,4,5,6-Tetrahydro-pyrimidin-2-ylamino)-butyrylamino]-methyl}-6,9-dihydro-5H-benzocyclohepten-5-yl)-acetic acid | CHEMBL109930
TypeSmall organic molecule
Emp. Form.C22H30N4O3
Mol. Mass.398.4986
SMILESOC(=O)CC1CC(CNC(=O)CCCNC2=NCCCN2)=CCc2ccccc12