Reaction Details
TargetMatrix metalloproteinase-9
LigandBDBM50120695
Substrate/Competitorn/a
Meas. Tech.ChEMBL_105374 (CHEMBL712453)
Ki>2000±n/a nM
Citation Duan, JJChen, LWasserman, ZRLu, ZLiu, RQCovington, MBQian, MHardman, KDMagolda, RLNewton, RCChrist, DDWexler, RRDecicco, CP Discovery of gamma-lactam hydroxamic acids as selective inhibitors of tumor necrosis factor alpha converting enzyme: design, synthesis, and structure-activity relationships. J Med Chem45:4954-7 (2002) Matrix metalloproteinase-9
Name:Matrix metalloproteinase-9
Type:Enzyme
Mol. Mass.:78452.28
Organism:Homo sapiens (Human)
Description:P14780
Residue:707
BDBM50120695
NameBDBM50120695
Synonyms:2-{3-[4-(3,5-Dimethoxy-benzyloxy)-phenyl]-3-methyl-2-oxo-pyrrolidin-1-yl}-N-hydroxy-propionamide | CHEMBL143451
TypeSmall organic molecule
Emp. Form.C23H28N2O6
Mol. Mass.428.4782
SMILESCOc1cc(COc2ccc(cc2)[C@]2(C)CCN([C@H](C)C(=O)NO)C2=O)cc(OC)c1