Reaction Details
Target72 kDa type IV collagenase
LigandBDBM50120694
Substrate/Competitorn/a
Meas. Tech.ChEMBL_104397 (CHEMBL715000)
Ki 108±n/a nM
Citation Duan, JJChen, LWasserman, ZRLu, ZLiu, RQCovington, MBQian, MHardman, KDMagolda, RLNewton, RCChrist, DDWexler, RRDecicco, CP Discovery of gamma-lactam hydroxamic acids as selective inhibitors of tumor necrosis factor alpha converting enzyme: design, synthesis, and structure-activity relationships. J Med Chem45:4954-7 (2002) 72 kDa type IV collagenase
Name:72 kDa type IV collagenase
Type:Enzyme
Mol. Mass.:73870.36
Organism:Homo sapiens (Human)
Description: P08253
Residue:660
BDBM50120694
NameBDBM50120694
Synonyms:CHEMBL356975 | N-Hydroxy-2-(3-methyl-2-oxo-3-phenyl-pyrrolidin-1-yl)-propionamide
TypeSmall organic molecule
Emp. Form.C14H18N2O3
Mol. Mass.262.3043
SMILESC[C@@H](N1CC[C@](C)(C1=O)c1ccccc1)C(=O)NO