Reaction Details
TargetInterstitial collagenase
LigandBDBM50120687
Substrate/Competitorn/a
Meas. Tech.ChEMBL_106129 (CHEMBL718677)
Ki>5000±n/a nM
Citation Duan, JJChen, LWasserman, ZRLu, ZLiu, RQCovington, MBQian, MHardman, KDMagolda, RLNewton, RCChrist, DDWexler, RRDecicco, CP Discovery of gamma-lactam hydroxamic acids as selective inhibitors of tumor necrosis factor alpha converting enzyme: design, synthesis, and structure-activity relationships. J Med Chem45:4954-7 (2002) Interstitial collagenase
Name:Interstitial collagenase
Type:Enzyme
Mol. Mass.:54010.26
Organism:Homo sapiens (Human)
Description: P03956
Residue:469
BDBM50120687
NameBDBM50120687
Synonyms:CHEMBL144081 | N-Hydroxy-2-{3-methyl-3-[4-(2-nitro-benzyloxy)-phenyl]-2-oxo-pyrrolidin-1-yl}-propionamide
TypeSmall organic molecule
Emp. Form.C21H23N3O6
Mol. Mass.413.4238
SMILESC[C@@H](N1CC[C@](C)(C1=O)c1ccc(OCc2ccccc2[N+]([O-])=O)cc1)C(=O)NO