Reaction Details
TargetInterstitial collagenase
LigandBDBM50120688
Substrate/Competitorn/a
Meas. Tech.ChEMBL_106129 (CHEMBL718677)
Ki 92±n/a nM
Citation Duan, JJChen, LWasserman, ZRLu, ZLiu, RQCovington, MBQian, MHardman, KDMagolda, RLNewton, RCChrist, DDWexler, RRDecicco, CP Discovery of gamma-lactam hydroxamic acids as selective inhibitors of tumor necrosis factor alpha converting enzyme: design, synthesis, and structure-activity relationships. J Med Chem45:4954-7 (2002) Interstitial collagenase
Name:Interstitial collagenase
Type:Enzyme
Mol. Mass.:54010.26
Organism:Homo sapiens (Human)
Description: P03956
Residue:469
BDBM50120688
NameBDBM50120688
Synonyms:CHEMBL146896 | N-Hydroxy-2-[3-(4-methoxy-phenyl)-3-methyl-2-oxo-pyrrolidin-1-yl]-propionamide
TypeSmall organic molecule
Emp. Form.C15H20N2O4
Mol. Mass.292.3303
SMILESCOc1ccc(cc1)[C@]1(C)CCN([C@H](C)C(=O)NO)C1=O