Reaction Details
TargetCytochrome c oxidase subunit 2
LigandBDBM13066
Substrate/Competitorn/a
Meas. Tech.ChEMBL_2067170 (CHEMBL4722423)
IC50 10050±n/a nM
Citation Jan, MSAhmad, SHussain, FAhmad, AMahmood, FRashid, UAbid, OUUllah, FAyaz, MSadiq, A Design, synthesis, in-vitro, in-vivo and in-silico studies of pyrrolidine-2,5-dione derivatives as multitarget anti-inflammatory agents. Eur J Med Chem186:0 (2020) 
 
Cytochrome c oxidase subunit 2
Name:Cytochrome c oxidase subunit 2
Type:PROTEIN
Mol. Mass.:25555.66
Organism:Homo sapiens (Human)
Description:ChEMBL_530099
Residue:227
BDBM13066
NameBDBM13066
Synonyms:2-{2-[(2,6-dichlorophenyl)amino]phenyl}acetic acid Diclofenac US11478464, Compound Diclofenac {2-[(2,6-dichlorophenyl)amino]phenyl}acetic acid
TypeSmall organic molecule
Emp. Form.C14H11Cl2NO2
Mol. Mass.296.149
SMILESOC(=O)Cc1ccccc1Nc1c(Cl)cccc1Cl