Reaction Details
TargetTripeptidyl-peptidase 2
LigandBDBM50121282
Substrate/Competitorn/a
Meas. Tech.ChEMBL_211946 (CHEMBL816536)
IC50 7±n/a nM
Citation Breslin, HJMiskowski, TAKukla, MJLeister, WHDe Winter, HLGauthier, DASomers, MVPeeters, DCRoevens, PW Design, synthesis, and tripeptidyl peptidase II inhibitory activity of a novel series of (S)-2,3-dihydro-2-(4-alkyl-1H-imidazol-2-yl)-1H-indoles. J Med Chem45:5303-10 (2002) Tripeptidyl-peptidase 2
Name:Tripeptidyl-peptidase 2
Type:PROTEIN
Mol. Mass.:138287.08
Organism:Rattus norvegicus
Description:ChEMBL_211948
Residue:1249
BDBM50121282
NameBDBM50121282
Synonyms:(S)-1-((S)-2-aminobutanoyl)-N-butylindoline-2-carboxamide CHEMBL151059
TypeSmall organic molecule
Emp. Form.C17H25N3O2
Mol. Mass.303.3993
SMILESCCCCNC(=O)[C@@H]1Cc2ccccc2N1C(=O)[C@@H](N)CC