Reaction Details
TargetTyrosinase
LigandBDBM50559076
Substrate/Competitorn/a
Meas. Tech.ChEMBL_2067840 (CHEMBL4723093)
Ki 250±n/a nM
Citation Roulier, BPérès, BHaudecoeur, R Advances in the Design of Genuine Human Tyrosinase Inhibitors for Targeting Melanogenesis and Related Pigmentations. J Med Chem63:13428-13443 (2020) 
 
Tyrosinase
Name:Tyrosinase
Type:Protein
Mol. Mass.:60388.08
Organism:Homo sapiens (Human)
Description:P14679
Residue:529
BDBM50559076
NameBDBM50559076
Synonyms:CHEMBL4743159
TypeSmall organic molecule
Emp. Form.C13H14N2O3S
Mol. Mass.278.327
SMILESCC(C)C(=O)Nc1nc(cs1)-c1ccc(O)cc1O