Reaction Details
TargetTyrosinase
LigandBDBM50248158
Substrate/Competitorn/a
Meas. Tech.ChEMBL_2067840 (CHEMBL4723093)
Ki 9100±n/a nM
Citation Roulier, BPérès, BHaudecoeur, R Advances in the Design of Genuine Human Tyrosinase Inhibitors for Targeting Melanogenesis and Related Pigmentations. J Med Chem63:13428-13443 (2020) 
 
Tyrosinase
Name:Tyrosinase
Type:Protein
Mol. Mass.:60388.08
Organism:Homo sapiens (Human)
Description:P14679
Residue:529
BDBM50248158
NameBDBM50248158
Synonyms:CHEMBL450195 US8993596, 4-Butylresorcinol (Rucinol) | US9422261, 4-Butyl- resorcinol
TypeSmall organic molecule
Emp. Form.C10H14O2
Mol. Mass.166.217
SMILESCCCCc1ccc(O)cc1O