Reaction Details
TargetTyrosinase
LigandBDBM50292636
Substrate/Competitorn/a
Meas. Tech.ChEMBL_2067840 (CHEMBL4723093)
Ki 39000±n/a nM
Citation Roulier, BPérès, BHaudecoeur, R Advances in the Design of Genuine Human Tyrosinase Inhibitors for Targeting Melanogenesis and Related Pigmentations. J Med Chem63:13428-13443 (2020) 
 
Tyrosinase
Name:Tyrosinase
Type:Protein
Mol. Mass.:60388.08
Organism:Homo sapiens (Human)
Description:P14679
Residue:529
BDBM50292636
NameBDBM50292636
Synonyms:4-hexyl resorcinol CHEMBL443605
TypeSmall organic molecule
Emp. Form.C12H18O2
Mol. Mass.194.2701
SMILESCCCCCCc1ccc(O)cc1O