Reaction Details
TargetTyrosinase
LigandBDBM197302
Substrate/Competitorn/a
Meas. Tech.ChEMBL_2067845 (CHEMBL4723098)
Ki 520000±n/a nM
Citation Roulier, BPérès, BHaudecoeur, R Advances in the Design of Genuine Human Tyrosinase Inhibitors for Targeting Melanogenesis and Related Pigmentations. J Med Chem63:13428-13443 (2020) 
 
Tyrosinase
Name:Tyrosinase
Type:Protein
Mol. Mass.:60388.08
Organism:Homo sapiens (Human)
Description:P14679
Residue:529
BDBM197302
NameBDBM197302
Synonyms:Benzoic acid | SAMPL4, O1
TypeSmall organic molecule
Emp. Form.C7H6O2
Mol. Mass.122.1213
SMILESOC(=O)c1ccccc1