Reaction Details
TargetTyrosinase
LigandBDBM50198715
Substrate/Competitorn/a
Meas. Tech.ChEMBL_2067859 (CHEMBL4723112)
Ki 10300±n/a nM
Citation Roulier, BPérès, BHaudecoeur, R Advances in the Design of Genuine Human Tyrosinase Inhibitors for Targeting Melanogenesis and Related Pigmentations. J Med Chem63:13428-13443 (2020) 
 
Tyrosinase
Name:Tyrosinase
Type:Protein
Mol. Mass.:60388.08
Organism:Homo sapiens (Human)
Description:P14679
Residue:529
BDBM50198715
NameBDBM50198715
Synonyms:(2S)-2-amino-3-(3-hydroxy-4-oxopyridin-1(4H)-yl)propanoic acid L-mimosine
TypeSmall organic molecule
Emp. Form.C8H10N2O4
Mol. Mass.198.176
SMILESN[C@@H](Cn1ccc(=O)c(O)c1)C(O)=O