Reaction Details
TargetTyrosinase
LigandBDBM50240041
Substrate/Competitorn/a
Meas. Tech.ChEMBL_2067860 (CHEMBL4723113)
Ki 1700±n/a nM
Citation Roulier, BPérès, BHaudecoeur, R Advances in the Design of Genuine Human Tyrosinase Inhibitors for Targeting Melanogenesis and Related Pigmentations. J Med Chem63:13428-13443 (2020) 
 
Tyrosinase
Name:Tyrosinase
Type:Protein
Mol. Mass.:60388.08
Organism:Homo sapiens (Human)
Description:P14679
Residue:529
BDBM50240041
NameBDBM50240041
Synonyms:1-phenyl-2-thiourea CHEMBL263376 N-Phenylthiourea | phenylthiourea
TypeSmall organic molecule
Emp. Form.C7H8N2S
Mol. Mass.152.217
SMILESNC(=S)Nc1ccccc1