Reaction Details
TargetTyrosinase
LigandBDBM50559087
Substrate/Competitorn/a
Meas. Tech.ChEMBL_2067861 (CHEMBL4723114)
Ki 75000±n/a nM
Citation Roulier, BPérès, BHaudecoeur, R Advances in the Design of Genuine Human Tyrosinase Inhibitors for Targeting Melanogenesis and Related Pigmentations. J Med Chem63:13428-13443 (2020) 
 
Tyrosinase
Name:Tyrosinase
Type:Protein
Mol. Mass.:60388.08
Organism:Homo sapiens (Human)
Description:P14679
Residue:529
BDBM50559087
NameBDBM50559087
Synonyms:CHEMBL4794995
TypeSmall organic molecule
Emp. Form.C9H13NO2
Mol. Mass.167.205
SMILESCCCn1cc(O)c(=O)cc1C