Reaction Details
TargetTyrosinase
LigandBDBM50559088
Substrate/Competitorn/a
Meas. Tech.ChEMBL_2067861 (CHEMBL4723114)
Ki 100000±n/a nM
Citation Roulier, BPérès, BHaudecoeur, R Advances in the Design of Genuine Human Tyrosinase Inhibitors for Targeting Melanogenesis and Related Pigmentations. J Med Chem63:13428-13443 (2020) 
 
Tyrosinase
Name:Tyrosinase
Type:Protein
Mol. Mass.:60388.08
Organism:Homo sapiens (Human)
Description:P14679
Residue:529
BDBM50559088
NameBDBM50559088
Synonyms:CHEMBL4777553
TypeSmall organic molecule
Emp. Form.C10H15NO2
Mol. Mass.181.2316
SMILESCCCCn1cc(O)c(=O)cc1C