Reaction Details
TargetTyrosinase
LigandBDBM50559094
Substrate/Competitorn/a
Meas. Tech.ChEMBL_2067861 (CHEMBL4723114)
Ki 46000±n/a nM
Citation Roulier, BPérès, BHaudecoeur, R Advances in the Design of Genuine Human Tyrosinase Inhibitors for Targeting Melanogenesis and Related Pigmentations. J Med Chem63:13428-13443 (2020) 
 
Tyrosinase
Name:Tyrosinase
Type:Protein
Mol. Mass.:60388.08
Organism:Homo sapiens (Human)
Description:P14679
Residue:529
BDBM50559094
NameBDBM50559094
Synonyms:CHEMBL4751526
TypeSmall organic molecule
Emp. Form.C7H8O3S
Mol. Mass.172.202
SMILESCSCc1cc(=O)c(O)co1