Reaction Details
TargetTyrosinase
LigandBDBM50330108
Substrate/Competitorn/a
Meas. Tech.ChEMBL_2067861 (CHEMBL4723114)
Ki 19000±n/a nM
Citation Roulier, BPérès, BHaudecoeur, R Advances in the Design of Genuine Human Tyrosinase Inhibitors for Targeting Melanogenesis and Related Pigmentations. J Med Chem63:13428-13443 (2020) 
 
Tyrosinase
Name:Tyrosinase
Type:Protein
Mol. Mass.:60388.08
Organism:Homo sapiens (Human)
Description:P14679
Residue:529
BDBM50330108
NameBDBM50330108
Synonyms:2-(ethylthiomethyl)-5-hydroxy-4H-pyran-4-one | CHEMBL1269349
TypeSmall organic molecule
Emp. Form.C8H10O3S
Mol. Mass.186.228
SMILESCCSCc1cc(=O)c(O)co1