Reaction Details
TargetTyrosinase
LigandBDBM50330109
Substrate/Competitorn/a
Meas. Tech.ChEMBL_2067861 (CHEMBL4723114)
Ki 27000±n/a nM
Citation Roulier, BPérès, BHaudecoeur, R Advances in the Design of Genuine Human Tyrosinase Inhibitors for Targeting Melanogenesis and Related Pigmentations. J Med Chem63:13428-13443 (2020) 
 
Tyrosinase
Name:Tyrosinase
Type:Protein
Mol. Mass.:60388.08
Organism:Homo sapiens (Human)
Description:P14679
Residue:529
BDBM50330109
NameBDBM50330109
Synonyms:5-hydroxy-2-(propylthiomethyl)-4H-pyran-4-one | CHEMBL1269350
TypeSmall organic molecule
Emp. Form.C9H12O3S
Mol. Mass.200.255
SMILESCCCSCc1cc(=O)c(O)co1