Reaction Details
TargetTyrosinase
LigandBDBM50330111
Substrate/Competitorn/a
Meas. Tech.ChEMBL_2067861 (CHEMBL4723114)
Ki 46000±n/a nM
Citation Roulier, BPérès, BHaudecoeur, R Advances in the Design of Genuine Human Tyrosinase Inhibitors for Targeting Melanogenesis and Related Pigmentations. J Med Chem63:13428-13443 (2020) 
 
Tyrosinase
Name:Tyrosinase
Type:Protein
Mol. Mass.:60388.08
Organism:Homo sapiens (Human)
Description:P14679
Residue:529
BDBM50330111
NameBDBM50330111
Synonyms:5-hydroxy-2-(pentylthiomethyl)-4H-pyran-4-one | CHEMBL1269399
TypeSmall organic molecule
Emp. Form.C11H16O3S
Mol. Mass.228.308
SMILESCCCCCSCc1cc(=O)c(O)co1