Reaction Details
TargetTyrosinase
LigandBDBM50206007
Substrate/Competitorn/a
Meas. Tech.ChEMBL_2067865 (CHEMBL4723118)
Ki 3400±n/a nM
Citation Roulier, BPérès, BHaudecoeur, R Advances in the Design of Genuine Human Tyrosinase Inhibitors for Targeting Melanogenesis and Related Pigmentations. J Med Chem63:13428-13443 (2020) 
 
Tyrosinase
Name:Tyrosinase
Type:Protein
Mol. Mass.:60388.08
Organism:Homo sapiens (Human)
Description:P14679
Residue:529
BDBM50206007
NameBDBM50206007
Synonyms:3-Hydroxy-chromen-2-one CHEMBL150372
TypeSmall organic molecule
Emp. Form.C9H6O3
Mol. Mass.162.1421
SMILESOc1cc2ccccc2oc1=O