Reaction Details
TargetDihydroorotate dehydrogenase (quinone), mitochondrial
LigandBDBM15339
Substrate/Competitorn/a
Meas. Tech.ChEMBL_2068141 (CHEMBL4723394)
IC50 12±n/a nM
Citation Bouzriba, CLarcher, LGagné-Boulet, MFortin, S N-phenyl ureidobenzenesulfonates, a novel class of promising human dihydroorotate dehydrogenase inhibitors. Bioorg Med Chem28:0 (2020) 
 
Dihydroorotate dehydrogenase (quinone), mitochondrial
Name:Dihydroorotate dehydrogenase (quinone), mitochondrial
Type:Enzyme
Mol. Mass.:42881.33
Organism:Homo sapiens (Human)
Description:Q02127
Residue:395
BDBM15339
NameBDBM15339
Synonyms:6-fluoro-2-[4-(2-fluorophenyl)phenyl]-3-methyl-quinoline-4-carboxylic acid Biphenquinate US20240034730, Compound Brequinar
TypeSmall organic molecule
Emp. Form.C23H15F2NO2
Mol. Mass.375.3675
SMILESCc1c(nc2ccc(F)cc2c1C(O)=O)-c1ccc(cc1)-c1ccccc1F