Reaction Details
TargetDihydroorotate dehydrogenase (quinone), mitochondrial
LigandBDBM50559136
Substrate/Competitorn/a
Meas. Tech.ChEMBL_2068141 (CHEMBL4723394)
IC50 72±n/a nM
Citation Bouzriba, CLarcher, LGagné-Boulet, MFortin, S N-phenyl ureidobenzenesulfonates, a novel class of promising human dihydroorotate dehydrogenase inhibitors. Bioorg Med Chem28:0 (2020) 
 
Dihydroorotate dehydrogenase (quinone), mitochondrial
Name:Dihydroorotate dehydrogenase (quinone), mitochondrial
Type:Enzyme
Mol. Mass.:42881.33
Organism:Homo sapiens (Human)
Description:Q02127
Residue:395
BDBM50559136
NameBDBM50559136
Synonyms:CHEMBL2165736
TypeSmall organic molecule
Emp. Form.C17H20N2O4S
Mol. Mass.348.417
SMILESCCNC(=O)Nc1ccc(cc1)S(=O)(=O)Oc1ccccc1CC