Reaction Details
TargetCannabinoid receptor 2
LigandBDBM50121425
Substrate/Competitorn/a
Meas. Tech.ChEBML_46996
Ki 0.290000±n/a nM
Citation Papahatjis, DPNikas, SPAndreou, TMakriyannis, A Novel 1',1'-chain substituted Delta(8)-tetrahydrocannabinols. Bioorg Med Chem Lett12:3583-6 (2002) Cannabinoid receptor 2
Name:Cannabinoid receptor 2
Type:Enzyme Catalytic Domain
Mol. Mass.:38220.43
Organism:MOUSE
Description:P47936
Residue:347
BDBM50121425
NameBDBM50121425
Synonyms:(6aR,10aR)-3-(2,2-Dichloro-1-hexyl-cyclopropyl)-6,6,9-trimethyl-6a,7,10,10a-tetrahydro-6H-benzo[c]chromen-1-ol CHEMBL120669
TypeSmall organic molecule
Emp. Form.C25H34Cl2O2
Mol. Mass.437.442
SMILESCCCCCCC1(CC1(Cl)Cl)c1cc(O)c2[C@@H]3CC(C)=CC[C@H]3C(C)(C)Oc2c1