Reaction Details
TargetCannabinoid receptor 2
LigandBDBM50063884
Substrate/Competitorn/a
Meas. Tech.ChEBML_46996
Ki 0.860000±n/a nM
Citation Papahatjis, DPNikas, SPAndreou, TMakriyannis, A Novel 1',1'-chain substituted Delta(8)-tetrahydrocannabinols. Bioorg Med Chem Lett12:3583-6 (2002) Cannabinoid receptor 2
Name:Cannabinoid receptor 2
Type:Enzyme Catalytic Domain
Mol. Mass.:38220.43
Organism:MOUSE
Description:P47936
Residue:347
BDBM50063884
NameBDBM50063884
Synonyms:(6aR,10aR)-3-(1-Hexyl-cyclopropyl)-6,6,9-trimethyl-6a,7,10,10a-tetrahydro-6H-benzo[c]chromen-1-ol CHEMBL19847
TypeSmall organic molecule
Emp. Form.C25H36O2
Mol. Mass.368.5521
SMILESCCCCCCC1(CC1)c1cc(O)c2[C@@H]3CC(C)=CC[C@H]3C(C)(C)Oc2c1