Reaction Details
TargetIntegrin alpha-V/beta-3
LigandBDBM50121964
Substrate/Competitorn/a
Meas. Tech.ChEMBL_214640 (CHEMBL819720)
IC50 0.04±n/a nM
Citation Feuston, BPCulberson, JCDuggan, MEHartman, GDLeu, CTRodan, SB Binding model for nonpeptide antagonists of alpha(v)beta(3) integrin. J Med Chem45:5640-8 (2002) Integrin alpha-V/beta-3
Name:Integrin alpha-V/beta-3
Type:Enzyme
Mol. Mass.:n/a
Description:n/a
Components:This complex has 2 components.
Component 1
Name:Integrin alpha-V
Synonyms:ITAV_HUMAN Integrin alpha-V/alpha-5 VNRA Vitronectin receptor | Vitronectin receptor subunit alpha
Type:PROTEIN
Mol. Mass.:116024.92
Organism:Homo sapiens (Human)
Description:ChEMBL_582336
Residue:1048
Component 2
Name:Integrin beta-3
Synonyms:CD_antigen=CD61 GPIIIa ITGB3 Platelet membrane glycoprotein IIIa
Type:Protein
Mol. Mass.:87038.91
Organism:Homo sapiens (Human)
Description:P05106
Residue:788
BDBM50121964
NameBDBM50121964
Synonyms:3-(2-{2-Oxo-3-[2-(5,6,7,8-tetrahydro-[1,8]naphthyridin-2-yl)-ethyl]-pyrrolidin-1-yl}-acetylamino)-3-quinolin-3-yl-propionic acid | CHEMBL151142
TypeSmall organic molecule
Emp. Form.C28H31N5O4
Mol. Mass.501.5768
SMILESOC(=O)C[C@H](NC(=O)CN1CCC(CCc2ccc3CCCNc3n2)C1=O)c1cnc2ccccc2c1